Target
Serine/threonine-protein kinase ULK1
Ligand
BDBM50111577
Substrate
Meas. Tech.
ChEMBL_1711142 (CHEMBL4121191)
IC50
8.0±n/a nM
Citation
 Zhang, LOuyang, LGuo, YZhang, JLiu, B UNC-51-like Kinase 1: From an Autophagic Initiator to Multifunctional Drug Target. J Med Chem 61:6491-6500 (2018)  
Target
Name:
Serine/threonine-protein kinase ULK1
Synonyms:
ATG1 KIAA0722 ULK1_HUMAN hATG1
Type:
PROTEIN
Mol. Mass.:
112661.80
Organism:
Homo sapiens (Human)
Description:
ChEMBL_1510275
Residue:
1050
  
Inhibitor
Name:
BDBM50111577
Synonyms:
CHEMBL3605055
Type:
Small organic molecule
Emp. Form.:
C22H20N8
Mol. Mass.:
396.4478
SMILES:
C1CC(C1)c1cc(Nc2nc(Nc3ccc4[nH]cnc4c3)nc3ccccc23)n[nH]1
: