Target
Serine/threonine-protein kinase ULK1
Ligand
BDBM50271370
Substrate
Meas. Tech.
ChEMBL_1711143 (CHEMBL4121192)
IC50
45±n/a nM
Citation
 Zhang, LOuyang, LGuo, YZhang, JLiu, B UNC-51-like Kinase 1: From an Autophagic Initiator to Multifunctional Drug Target. J Med Chem 61:6491-6500 (2018)  
Target
Name:
Serine/threonine-protein kinase ULK1
Synonyms:
ATG1 KIAA0722 ULK1_HUMAN hATG1
Type:
PROTEIN
Mol. Mass.:
112661.80
Organism:
Homo sapiens (Human)
Description:
ChEMBL_1510275
Residue:
1050
  
Inhibitor
Name:
BDBM50271370
Synonyms:
CHEMBL4127042
Type:
Small organic molecule
Emp. Form.:
C25H35N7
Mol. Mass.:
433.5923
SMILES:
CN1CCc2cc(Nc3ncc(C4CC4)c(NCCCNC(=N)C4CCC4)n3)ccc2C1
: