Target
Serine/threonine-protein kinase ULK1
Ligand
BDBM50111572
Substrate
Meas. Tech.
ChEMBL_1711143 (CHEMBL4121192)
IC50
2.9±n/a nM
Citation
 Zhang, LOuyang, LGuo, YZhang, JLiu, B UNC-51-like Kinase 1: From an Autophagic Initiator to Multifunctional Drug Target. J Med Chem 61:6491-6500 (2018)  
Target
Name:
Serine/threonine-protein kinase ULK1
Synonyms:
ATG1 KIAA0722 ULK1_HUMAN hATG1
Type:
PROTEIN
Mol. Mass.:
112661.80
Organism:
Homo sapiens (Human)
Description:
ChEMBL_1510275
Residue:
1050
  
Inhibitor
Name:
BDBM50111572
Synonyms:
CHEMBL3605057
Type:
Small organic molecule
Emp. Form.:
C26H36N6O2
Mol. Mass.:
464.603
SMILES:
O=C(NCCCNc1nc(Nc2cccc(CN3CCOCC3)c2)ncc1C1CC1)C1CCC1
: