Target
Serine protease hepsin
Ligand
BDBM50272349
Substrate
Meas. Tech.
ChEMBL_1712213 (CHEMBL4122262)
IC50
300±n/a nM
Citation
 Pant, SMMukonoweshuro, ADesai, BRamjee, MKSelway, CNTarver, GJWright, AGBirchall, KChapman, TMTervonen, TAKlefström, J Design, Synthesis, and Testing of Potent, Selective Hepsin Inhibitors via Application of an Automated Closed-Loop Optimization Platform. J Med Chem 61:4335-4347 (2018)  
Target
Name:
Serine protease hepsin
Synonyms:
HEPS_HUMAN Hepsin TMPRSS1 Transmembrane protease, serine 1
Type:
Enzyme
Mol. Mass.:
45016.98
Organism:
Homo sapiens (Human)
Description:
Human deglycosylated hepsin was expressed in Pichia pastoris.
Residue:
417
  
Inhibitor
Name:
BDBM50272349
Synonyms:
CHEMBL4125890
Type:
Small organic molecule
Emp. Form.:
C22H28N4O4S
Mol. Mass.:
444.547
SMILES:
COc1ccc(cc1)S(=O)(=O)N[C@H](C1CCCCC1)C(=O)Nc1ccc(cc1)C(N)=N
: