Target
Cysteinyl leukotriene receptor 1/2
Ligand
BDBM50009075
Substrate
Meas. Tech.
ChEMBL_52221 (CHEMBL663971)
Ki
0.200000±n/a nM
Citation
 Galemmo, RAJohnson, WHLearn, KSLee, TDHuang, FCCampbell, HFYoussefyeh, RO'Rourke, SVSchuessler, GSweeney, DM The development of a novel series of (quinolin-2-ylmethoxy)phenyl-containing compounds as high-affinity leukotriene receptor antagonists. 3. Structural variation of the acidic side chain to give antagonists of enhanced potency. J Med Chem 33:2828-41 (1990)  
Target
Name:
Cysteinyl leukotriene receptor 1/2
Synonyms:
Cysteinyl leukotriene receptor
Type:
Mol. Mass.:
Description:
ASSAY_ID of ChEMBL is 98640
Components:
This complex has 2 components.
Component 1
Name:
Cysteinyl leukotriene receptor 1
Synonyms:
CLTR1_HUMAN CYSLTR1 Cysteinyl leukotriene receptor HG55 LTD4 receptor | Leukotriene Cysteinyl 1
Type:
Enzyme Catalytic Domain
Mol. Mass.:
38565.16
Organism:
Homo sapiens (Human)
Description:
Leukotriene Cysteinyl 1 CYSLTR1 HUMAN::Q9Y271
Residue:
337
  
Component 2
Name:
Cysteinyl leukotriene receptor 2
Synonyms:
CLTR2_HUMAN CYSLT2R Cysteinyl leukotriene receptor Leukotriene Cysteinyl 2
Type:
Enzyme Catalytic Domain
Mol. Mass.:
39657.52
Organism:
Homo sapiens (Human)
Description:
Leukotriene Cysteinyl 2 CYSLTR2 HUMAN::Q9NS75
Residue:
346
  
Inhibitor
Name:
BDBM50009075
Synonyms:
CHEMBL22033 ICI-198615 [1-(4-Benzenesulfonylaminocarbonyl-2-methoxy-benzyl)-1H-indazol-6-yl]-carbamic acid cyclopentyl ester [1-(4-Benzenesulfonylaminocarbonyl-2-methoxy-benzyl)-1H-indazol-6-yl]-carbamic acid cyclopentyl ester(ICI 198, 615) | [1-(4-Benzenesulfonylaminocarbonyl-2-methoxy-benzyl)-1H-indazol-6-yl]-carbamic acid cyclopentyl ester(ICI 198615)
Type:
Small organic molecule
Emp. Form.:
C28H28N4O6S
Mol. Mass.:
548.61
SMILES:
COc1cc(ccc1Cn1ncc2ccc(NC(=O)OC3CCCC3)cc12)C(=O)NS(=O)(=O)c1ccccc1
: