Target
Adenosine receptor A2a
Ligand
BDBM50273119
Substrate
Meas. Tech.
ChEMBL_1712827 (CHEMBL4122876)
Ki
>10000±n/a nM
Citation
 Boulahjar, RRincon Arias, ABolteau, RRenault, NCoevoet, MBarczyk, ADuroux, RYous, SMelnyk, PAgouridas, L Design and synthesis of 2,6-disubstituted-8-amino imidazo[1,2a]pyridines, a promising privileged structure. Bioorg Med Chem 26:3296-3307 (2018)  
Target
Name:
Adenosine receptor A2a
Synonyms:
A2A adenosine receptor (hA2A) ADENOSINE A2 ADORA2 Adenosine A2A receptor (A2AAR)
Type:
G Protein-Coupled Receptor (GPCR)
Mol. Mass.:
44716.46
Organism:
Homo sapiens (Human)
Description:
P29274
Residue:
412
  
Inhibitor
Name:
BDBM50273119
Synonyms:
CHEMBL4126775
Type:
Small organic molecule
Emp. Form.:
C23H19N3O2
Mol. Mass.:
369.4159
SMILES:
COc1ccc(cc1OC)-c1cn2cc(cc(N)c2n1)C#Cc1ccccc1
: