Target
Bromodomain-containing protein 4
Ligand
BDBM50273650
Substrate
Meas. Tech.
ChEMBL_1713102 (CHEMBL4123151)
IC50
303±n/a nM
Citation
 Jennings, LESchiedel, MHewings, DSPicaud, SLaurin, CMCBruno, PABluck, JPScorah, ARSee, LReynolds, JKMoroglu, MMistry, INHicks, AGuzanov, PClayton, JEvans, CNGStazi, GBiggin, PCMapp, AKHammond, EMHumphreys, PGFilippakopoulos, PConway, SJ BET bromodomain ligands: Probing the WPF shelf to improve BRD4 bromodomain affinity and metabolic stability. Bioorg Med Chem 26:2937-2957 (2018)  
Target
Name:
Bromodomain-containing protein 4
Synonyms:
BRD4 Bromodomain-containing protein 4 (BRD4) Protein HUNK1
Type:
Protein
Mol. Mass.:
152264.84
Organism:
Homo sapiens (Human)
Description:
O60885
Residue:
1362
  
Inhibitor
Name:
BDBM50273650
Synonyms:
CHEMBL4127775
Type:
Small organic molecule
Emp. Form.:
C17H16N2O3
Mol. Mass.:
296.3205
SMILES:
Cc1noc(C)c1-c1cc(O)cc(c1)C(O)c1ccncc1
: