Target
Adenosine receptor A2a/A2b
Ligand
BDBM50001493
Substrate
Meas. Tech.
ChEMBL_30563 (CHEMBL649875)
Ki
137000±n/a nM
Citation
 Daly, JWHide, IBridson, PK Imidazodiazepinediones: a new class of adenosine receptor antagonists. J Med Chem 33:2818-21 (1990)  
Target
Name:
Adenosine receptor A2a/A2b
Synonyms:
Adenosine A2 receptor
Type:
Mol. Mass.:
Description:
ASSAY_ID of ChEMBL is 30560
Components:
This complex has 2 components.
Component 1
Name:
Adenosine receptor A2b
Synonyms:
AA2BR_RAT Adora2b
Type:
PROTEIN
Mol. Mass.:
36378.84
Organism:
Rattus norvegicus
Description:
ChEMBL_32934
Residue:
332
  
Component 2
Name:
Adenosine receptor A2a
Synonyms:
AA2AR_RAT Adenosine A2 receptor Adenosine Receptors A2a (A2a) Adenosine receptors A2a Rat striatal adenosine A2a receptor
Type:
G Protein-Coupled Receptor (GPCR)
Mol. Mass.:
45015.65
Organism:
Rattus norvegicus (rat)
Description:
Rat A2A receptors expressed in CHO cells.
Residue:
410
  
Inhibitor
Name:
BDBM50001493
Synonyms:
3-Propyl-3,7-dihydro-purine-2,6-dione 3-Propylxanthine (enprofylline) ENPROFYLLINE
Type:
Small organic molecule
Emp. Form.:
C8H10N4O2
Mol. Mass.:
194.1906
SMILES:
CCCn1c2nc[nH]c2c(=O)[nH]c1=O
: