Target
Albumin
Ligand
BDBM50182486
Substrate
Meas. Tech.
ChEMBL_1713759 (CHEMBL4123808)
IC50
40340±n/a nM
Citation
 Prabha, BNeethu, SKrishnan, SLSherin, DRMadhukrishnan, MAnanthakrishnan, RRameshkumar, KBManojkumar, TKJayamurthy, PRadhakrishnan, KV Antidiabetic potential of phytochemicals isolated from the stem bark of Myristica fatua Houtt. var. magnifica (Bedd.) Sinclair. Bioorg Med Chem 26:3461-3467 (2018)  
Target
Name:
Albumin
Synonyms:
ALB Serum albumin | serum albumin precursor
Type:
PROTEIN
Mol. Mass.:
69288.15
Organism:
Bos taurus
Description:
ChEMBL_1502598
Residue:
607
  
Inhibitor
Name:
BDBM50182486
Synonyms:
MALABARICONE B
Type:
Small organic molecule
Emp. Form.:
C21H26O4
Mol. Mass.:
342.4287
SMILES:
Oc1ccc(CCCCCCCCC(=O)c2c(O)cccc2O)cc1
: