Target
Tyrosine-protein kinase JAK3
Ligand
BDBM50274606
Substrate
Meas. Tech.
ChEMBL_1714128 (CHEMBL4124177)
IC50
129±n/a nM
Citation
 Forster, MChaikuad, ADimitrov, TDöring, EHolstein, JBerger, BTGehringer, MGhoreschi, KMüller, SKnapp, SLaufer, SA Development, Optimization, and Structure-Activity Relationships of Covalent-Reversible JAK3 Inhibitors Based on a Tricyclic Imidazo[5,4- d]pyrrolo[2,3- b]pyridine Scaffold. J Med Chem 61:5350-5366 (2018)  
Target
Name:
Tyrosine-protein kinase JAK3
Synonyms:
JAK-3 JAK3_HUMAN Janus kinase 3 (JAK3) L-JAK | Leukocyte janus kinase
Type:
Protein
Mol. Mass.:
125111.08
Organism:
Homo sapiens (Human)
Description:
P52333
Residue:
1124
  
Inhibitor
Name:
BDBM50274606
Synonyms:
CHEMBL4129249
Type:
Small organic molecule
Emp. Form.:
C21H21N5O2
Mol. Mass.:
375.4237
SMILES:
NC(=O)\C=C\c1ccc(o1)-c1nc2cnc3[nH]ccc3c2n1C1CCCCC1
: