Target
Mu-type opioid receptor
Ligand
BDBM50274697
Substrate
Meas. Tech.
ChEMBL_1714218 (CHEMBL4124267)
IC50
1.5±n/a nM
Citation
 Willemse, TEiselt, EHollanders, KSchepens, Wvan Vlijmen, HWTChung, NNBlais, VHolleran, BLongpré, JMSchiller, PWMaes, BUWSarret, PGendron, LBallet, S Chemical space screening around Phe Bioorg Med Chem Lett 28:2320-2323 (2018)  
Target
Name:
Mu-type opioid receptor
Synonyms:
M-OR-1 Mu opioid receptor OPIATE Mu OPRM_CAVPO
Type:
Enzyme Catalytic Domain
Mol. Mass.:
11165.58
Organism:
GUINEA PIG
Description:
P97266
Residue:
98
  
Inhibitor
Name:
BDBM50274697
Synonyms:
CHEMBL4129689
Type:
Small organic molecule
Emp. Form.:
C32H42N8O5S
Mol. Mass.:
650.791
SMILES:
Cc1cc(O)cc(C)c1C[C@H](N)C(=O)N[C@H](CCCNC(N)=N)C(=O)N[C@@H](Cc1ccccc1-c1ccsc1)C(=O)NCC(N)=O
: