Target
Gastric inhibitory polypeptide receptor
Ligand
BDBM50275546
Substrate
Meas. Tech.
ChEMBL_1714753 (CHEMBL4124802)
EC50
177±n/a nM
Citation
 Evers, ABossart, MPfeiffer-Marek, SElvert, RSchreuder, HKurz, MStengelin, SLorenz, MHerling, AKonkar, ALukasczyk, UPfenninger, ALorenz, KHaack, TKadereit, DWagner, M Dual Glucagon-like Peptide 1 (GLP-1)/Glucagon Receptor Agonists Specifically Optimized for Multidose Formulations. J Med Chem 61:5580-5593 (2018)  
Target
Name:
Gastric inhibitory polypeptide receptor
Synonyms:
GIPR Gastric Inhibitory Polypeptide Receptor (GIPR) | Gastric inhibitory polypeptide receptor
Type:
PROTEIN
Mol. Mass.:
53173.82
Organism:
Homo sapiens (Human)
Description:
ChEMBL_1518286
Residue:
466
  
Inhibitor
Name:
BDBM50275546
Synonyms:
CHEMBL4130044
Type:
Small organic molecule
Emp. Form.:
C184H286N52O57
Mol. Mass.:
4138.5538
SMILES:
CC[C@H](C)[C@H](NC(=O)[C@H](Cc1ccccc1)NC(=O)[C@H](CC(C)C)NC(=O)[C@H](CCCCN)NC(=O)[C@H](C)NC(=O)[C@H](CCCNC(N)=N)NC(=O)[C@H](CCC(N)=O)NC(=O)[C@H](CCC(O)=O)NC(=O)[C@H](CC(O)=O)NC(=O)[C@H](CCCCN)NC(=O)[C@H](CCC(N)=O)NC(=O)[C@H](CCCCN)NC(=O)[C@H](CO)NC(=O)[C@H](CC(C)C)NC(=O)[C@H](CC(O)=O)NC(=O)[C@H](CO)NC(=O)[C@@H](NC(=O)[C@H](Cc1ccccc1)NC(=O)[C@@H](NC(=O)CNC(=O)[C@H](CCC(N)=O)NC(=O)C(C)(C)NC(=O)[C@@H](N)Cc1cnc[nH]1)[C@@H](C)O)[C@@H](C)O)C(=O)N[C@@H](CCC(O)=O)C(=O)N[C@@H](Cc1c[nH]c2ccccc12)C(=O)N[C@@H](CC(C)C)C(=O)NC(C)(C)C(=O)N[C@@H](C)C(=O)NCC(=O)NCC(=O)N1CCC[C@H]1C(=O)N[C@@H](CO)C(=O)N[C@@H](CO)C(=O)NCC(=O)N[C@@H](C)C(=O)N1CCC[C@H]1C(=O)N1CCC[C@H]1C(=O)N1CCC[C@H]1C(=O)N[C@@H](CO)C(N)=O
: