Target
Adenosine receptor A2a
Ligand
BDBM50275599
Substrate
Meas. Tech.
ChEMBL_1714785 (CHEMBL4124834)
Ki
4.7±n/a nM
Citation
 Varano, FCatarzi, DFalsini, MVincenzi, FPasquini, SVarani, KColotta, V Identification of novel thiazolo[5,4-d]pyrimidine derivatives as human A Bioorg Med Chem 26:3688-3695 (2018)  
Target
Name:
Adenosine receptor A2a
Synonyms:
A2A adenosine receptor (hA2A) ADENOSINE A2 ADORA2 Adenosine A2A receptor (A2AAR)
Type:
G Protein-Coupled Receptor (GPCR)
Mol. Mass.:
44716.46
Organism:
Homo sapiens (Human)
Description:
P29274
Residue:
412
  
Inhibitor
Name:
BDBM50275599
Synonyms:
CHEMBL4127213
Type:
Small organic molecule
Emp. Form.:
C19H17N5OS
Mol. Mass.:
363.436
SMILES:
COc1ccccc1CNc1nc(N)c2nc(sc2n1)-c1ccccc1
: