Target
Acetylcholinesterase
Ligand
BDBM50276072
Substrate
Meas. Tech.
ChEBML_1715128
IC50
260±n/a nM
Citation
 Derabli, CBoualia, IAbdelwahab, ABBoulcina, RBensouici, CKirsch, GDebache, A A cascade synthesis, in vitro cholinesterases inhibitory activity and docking studies of novel Tacrine-pyranopyrazole derivatives. Bioorg Med Chem Lett 28:2481-2484 (2018)  
Target
Name:
Acetylcholinesterase
Synonyms:
ACES_ELEEL Acetylcholinesterase (EeAChE) | ache
Type:
Enzyme
Mol. Mass.:
71812.79
Organism:
Electrophorus electricus (Electric eel)
Description:
Residue:
633
  
Inhibitor
Name:
BDBM50276072
Synonyms:
CHEMBL4127841
Type:
Small organic molecule
Emp. Form.:
C22H24N4O3
Mol. Mass.:
392.451
SMILES:
COc1ccc(C2c3c(C)[nH]nc3Oc3nc4CCCCc4c(N)c23)c(OC)c1
: