Target
Acetylcholinesterase
Ligand
BDBM50276088
Substrate
Meas. Tech.
ChEBML_1715128
IC50
330±n/a nM
Citation
 Derabli, CBoualia, IAbdelwahab, ABBoulcina, RBensouici, CKirsch, GDebache, A A cascade synthesis, in vitro cholinesterases inhibitory activity and docking studies of novel Tacrine-pyranopyrazole derivatives. Bioorg Med Chem Lett 28:2481-2484 (2018)  
Target
Name:
Acetylcholinesterase
Synonyms:
ACES_ELEEL Acetylcholinesterase (EeAChE) | ache
Type:
Enzyme
Mol. Mass.:
71812.79
Organism:
Electrophorus electricus (Electric eel)
Description:
Residue:
633
  
Inhibitor
Name:
BDBM50276088
Synonyms:
CHEMBL4130296
Type:
Small organic molecule
Emp. Form.:
C19H19N5O
Mol. Mass.:
333.3871
SMILES:
Cc1[nH]nc2Oc3nc4CCCCc4c(N)c3C(c12)c1cccnc1
: