Target
Peptidoglycan-N-acetylglucosamine deacetylase BC_1960
Ligand
BDBM50015149
Substrate
Meas. Tech.
ChEMBL_1715561 (CHEMBL4125610)
Ki
66000±n/a nM
Citation
 Balomenou, SKoutsioulis, DTomatsidou, ATzanodaskalaki, MPetratos, KBouriotis, V Polysaccharide deacetylases serve as new targets for the design of inhibitors against Bacillus anthracis and Bacillus cereus. Bioorg Med Chem 26:3845-3851 (2018)  
Target
Name:
Peptidoglycan-N-acetylglucosamine deacetylase BC_1960
Synonyms:
3.5.1.104 Peptidoglycan GlcNAc deacetylase | Peptidoglycan-N-acetylglucosamine deacetylase BC_1960
Type:
PROTEIN
Mol. Mass.:
31650.32
Organism:
Bacillus cereus (strain ATCC 14579 / DSM 31 / JCM 2152 / NBRC 15305 /NCIMB 9373 / NRRL B-3711)
Description:
ChEMBL_117860
Residue:
275
  
Inhibitor
Name:
BDBM50015149
Synonyms:
CHEMBL156887 N-hydroxy-4-(naphthalen-1-yl)benzamide
Type:
Small organic molecule
Emp. Form.:
C17H13NO2
Mol. Mass.:
263.2906
SMILES:
ONC(=O)c1ccc(cc1)-c1cccc2ccccc12
: