Target
NACHT, LRR and PYD domains-containing protein 3
Ligand
BDBM50276373
Substrate
Meas. Tech.
ChEMBL_1715620 (CHEMBL4125669)
IC50
4800±n/a nM
Citation
 Goto, KIdeo, HTsuchida, AHirose, YMaruyama, INoma, SShirai, TAmano, JMizuno, MMatsuda, A Synthesis of 1,5-Anhydro-d-fructose derivatives and evaluation of their inflammasome inhibitors. Bioorg Med Chem 26:3763-3772 (2018)  
Target
Name:
NACHT, LRR and PYD domains-containing protein 3
Synonyms:
C1orf7 NALP3 NLRP3 protein PYPAF1
Type:
Enzyme Catalytic Domain
Mol. Mass.:
118173.88
Organism:
Homo sapiens (Human)
Description:
Q96P20
Residue:
1036
  
Inhibitor
Name:
BDBM50276373
Synonyms:
CHEMBL4125713
Type:
Small organic molecule
Emp. Form.:
C6H5FO3
Mol. Mass.:
144.1005
SMILES:
[H][C@@]12CO[C@@]([H])(O1)C(=O)C(F)=C2
: