Target
NACHT, LRR and PYD domains-containing protein 3
Ligand
BDBM50276374
Substrate
Meas. Tech.
ChEMBL_1715618 (CHEMBL4125667)
IC50
1600000±n/a nM
Citation
 Goto, KIdeo, HTsuchida, AHirose, YMaruyama, INoma, SShirai, TAmano, JMizuno, MMatsuda, A Synthesis of 1,5-Anhydro-d-fructose derivatives and evaluation of their inflammasome inhibitors. Bioorg Med Chem 26:3763-3772 (2018)  
Target
Name:
NACHT, LRR and PYD domains-containing protein 3
Synonyms:
Cias1 Cold autoinflammatory syndrome 1 protein homolog Mast cell maturation-associated-inducible protein 1 NACHT, LRR and PYD domains-containing protein 3 Nalp3 PYRIN-containing APAF1-like protein 1 | Pypaf1
Type:
PROTEIN
Mol. Mass.:
118281.75
Organism:
Mus musculus
Description:
ChEMBL_116758
Residue:
1033
  
Inhibitor
Name:
BDBM50276374
Synonyms:
CHEMBL4126946
Type:
Small organic molecule
Emp. Form.:
C6H10O4
Mol. Mass.:
146.1412
SMILES:
OC[C@H]1OCC(=O)C[C@@H]1O
: