Target
Calpain-1 catalytic subunit
Ligand
BDBM50276901
Substrate
Meas. Tech.
ChEBML_1717039
Ki
9.0±n/a nM
Citation
 Keri, RSChand, KBudagumpi, SBalappa Somappa, SPatil, SANagaraja, BM An overview of benzo[b]thiophene-based medicinal chemistry. Eur J Med Chem 138:1002-1033 (2017)  
Target
Name:
Calpain-1 catalytic subunit
Synonyms:
CAN1_HUMAN CAPN1 Calpain-1 (u-Calpain) Calpain1
Type:
Protein
Mol. Mass.:
81880.51
Organism:
Homo sapiens (Human)
Description:
Residue:
714
  
Inhibitor
Name:
BDBM50276901
Synonyms:
CHEMBL4167219
Type:
Small organic molecule
Emp. Form.:
C24H25N3O3S
Mol. Mass.:
435.539
SMILES:
NC(=O)C(=O)C(Cc1ccccc1)NC(=O)C1CCN(CC1)c1cc2ccccc2s1
: