Target
Puromycin-sensitive aminopeptidase
Ligand
BDBM50277141
Substrate
Meas. Tech.
ChEBML_1717608
IC50
5000±n/a nM
Citation
 Singh, RWilliams, JVince, R Puromycin based inhibitors of aminopeptidases for the potential treatment of hematologic malignancies. Eur J Med Chem 139:325-336 (2017)  
Target
Name:
Puromycin-sensitive aminopeptidase
Synonyms:
Aminopeptidase PSA | PSA_HUMAN
Type:
PROTEIN
Mol. Mass.:
103262.98
Organism:
Homo sapiens (Human)
Description:
ChEMBL_160080
Residue:
919
  
Inhibitor
Name:
BDBM50277141
Synonyms:
CHEMBL4161496
Type:
Small organic molecule
Emp. Form.:
C21H27N7O4
Mol. Mass.:
441.4836
SMILES:
CN(C)c1ncnc2n(cnc12)[C@@H]1O[C@H](CO)[C@@H](NC(=O)[C@@H](N)Cc2ccccc2)[C@H]1O
: