Target
Puromycin-sensitive aminopeptidase
Ligand
BDBM50277143
Substrate
Meas. Tech.
ChEBML_1717608
IC50
260±n/a nM
Citation
 Singh, RWilliams, JVince, R Puromycin based inhibitors of aminopeptidases for the potential treatment of hematologic malignancies. Eur J Med Chem 139:325-336 (2017)  
Target
Name:
Puromycin-sensitive aminopeptidase
Synonyms:
Aminopeptidase PSA | PSA_HUMAN
Type:
PROTEIN
Mol. Mass.:
103262.98
Organism:
Homo sapiens (Human)
Description:
ChEMBL_160080
Residue:
919
  
Inhibitor
Name:
BDBM50277143
Synonyms:
CHR 2797 Tosedostat
Type:
Small organic molecule
Emp. Form.:
C21H30N2O6
Mol. Mass.:
406.4727
SMILES:
CC(C)C[C@H]([C@H](O)C(=O)NO)C(=O)N[C@H](C(=O)OC1CCCC1)c1ccccc1
: