Target
Puromycin-sensitive aminopeptidase
Ligand
BDBM50277150
Substrate
Meas. Tech.
ChEBML_1717608
IC50
53000±n/a nM
Citation
 Singh, RWilliams, JVince, R Puromycin based inhibitors of aminopeptidases for the potential treatment of hematologic malignancies. Eur J Med Chem 139:325-336 (2017)  
Target
Name:
Puromycin-sensitive aminopeptidase
Synonyms:
Aminopeptidase PSA | PSA_HUMAN
Type:
PROTEIN
Mol. Mass.:
103262.98
Organism:
Homo sapiens (Human)
Description:
ChEMBL_160080
Residue:
919
  
Inhibitor
Name:
BDBM50277150
Synonyms:
CHEMBL4161744
Type:
Small organic molecule
Emp. Form.:
C19H24N2O2S
Mol. Mass.:
344.471
SMILES:
N[C@@H](CSC(c1ccccc1)c1ccccc1)C(=O)NCCCO
: