Target
Angiotensin-converting enzyme
Ligand
BDBM50277167
Substrate
Meas. Tech.
ChEBML_1717668
IC50
5510±n/a nM
Citation
 Arcanjo, DDRVasconcelos, AGNascimento, LAMafud, ACPlácido, AAlves, MMMDelerue-Matos, CBemquerer, MPVale, NGomes, POliveira, EBLima, FCAMascarenhas, YPCarvalho, FAASimonsen, URamos, RMLeite, JRSA Structure-function studies of BPP-BrachyNH Eur J Med Chem 139:401-411 (2017)  
Target
Name:
Angiotensin-converting enzyme
Synonyms:
ACE_RAT Angiotensin-converting enzyme | Dcp1
Type:
PROTEIN
Mol. Mass.:
150907.81
Organism:
Rattus norvegicus
Description:
ChEMBL_35219
Residue:
1313
  
Inhibitor
Name:
BDBM50277167
Synonyms:
CHEMBL4167962
Type:
Small organic molecule
Emp. Form.:
C45H67N11O9
Mol. Mass.:
906.0818
SMILES:
CC(C)[C@H](NC(=O)[C@H](CCCCN)NC(=O)[C@@H]1CCCN1C(=O)[C@@H]1CCCN1C(=O)[C@@H]1CCCN1C(=O)[C@@H](N)Cc1c[nH]c2ccccc12)C(=O)N[C@@H](CO)C(=O)N1CCC[C@H]1C(N)=O
: