Target
Angiotensin-converting enzyme
Ligand
BDBM21642
Substrate
Meas. Tech.
ChEBML_1717668
IC50
3.2±n/a nM
Citation
 Arcanjo, DDRVasconcelos, AGNascimento, LAMafud, ACPlácido, AAlves, MMMDelerue-Matos, CBemquerer, MPVale, NGomes, POliveira, EBLima, FCAMascarenhas, YPCarvalho, FAASimonsen, URamos, RMLeite, JRSA Structure-function studies of BPP-BrachyNH Eur J Med Chem 139:401-411 (2017)  
Target
Name:
Angiotensin-converting enzyme
Synonyms:
ACE_RAT Angiotensin-converting enzyme | Dcp1
Type:
PROTEIN
Mol. Mass.:
150907.81
Organism:
Rattus norvegicus
Description:
ChEMBL_35219
Residue:
1313
  
Inhibitor
Name:
BDBM21642
Synonyms:
(2S)-1-[(2S)-2-methyl-3-sulfanylpropanoyl]pyrrolidine-2-carboxylic acid Capozide Lopirin SQ14534 | US11491146, Compound L-Captopril
Type:
Small organic molecule
Emp. Form.:
C9H15NO3S
Mol. Mass.:
217.285
SMILES:
C[C@H](CS)C(=O)N1CCC[C@H]1C(O)=O
: