Target
MAP kinase-interacting serine/threonine-protein kinase 2
Ligand
BDBM50277601
Substrate
Meas. Tech.
ChEMBL_1718275 (CHEMBL4133275)
Ki
230±n/a nM
Citation
 Diab, SAbdelaziz, AMLi, PTeo, TBasnet, SKCNoll, BRahaman, MHLu, JHou, JYu, MLe, BTAlbrecht, HMilne, RWWang, S Dual Inhibition of Mnk2 and FLT3 for potential treatment of acute myeloid leukaemia. Eur J Med Chem 139:762-772 (2017)  
Target
Name:
MAP kinase-interacting serine/threonine-protein kinase 2
Synonyms:
GPRK7 MAP kinase-interacting serine/threonine-protein kinase 2 (MKNK2) MAP-kinase interacting kinase 2 (MNK2) MKNK2_HUMAN | MNK2
Type:
Protein
Mol. Mass.:
51870.79
Organism:
Homo sapiens (Human)
Description:
Q9HBH9
Residue:
465
  
Inhibitor
Name:
BDBM50277601
Synonyms:
CHEMBL4167646
Type:
Small organic molecule
Emp. Form.:
C20H25N5O2S2
Mol. Mass.:
431.575
SMILES:
COc1ccc(Nc2nccc(n2)-c2sc(SCCN(C)C)nc2C)c(OC)c1
: