Target
MAP kinase-interacting serine/threonine-protein kinase 2
Ligand
BDBM50277607
Substrate
Meas. Tech.
ChEMBL_1718275 (CHEMBL4133275)
Ki
560±n/a nM
Citation
 Diab, SAbdelaziz, AMLi, PTeo, TBasnet, SKCNoll, BRahaman, MHLu, JHou, JYu, MLe, BTAlbrecht, HMilne, RWWang, S Dual Inhibition of Mnk2 and FLT3 for potential treatment of acute myeloid leukaemia. Eur J Med Chem 139:762-772 (2017)  
Target
Name:
MAP kinase-interacting serine/threonine-protein kinase 2
Synonyms:
GPRK7 MAP kinase-interacting serine/threonine-protein kinase 2 (MKNK2) MAP-kinase interacting kinase 2 (MNK2) MKNK2_HUMAN | MNK2
Type:
Protein
Mol. Mass.:
51870.79
Organism:
Homo sapiens (Human)
Description:
Q9HBH9
Residue:
465
  
Inhibitor
Name:
BDBM50277607
Synonyms:
CHEMBL4170718
Type:
Small organic molecule
Emp. Form.:
C20H24N4O3S
Mol. Mass.:
400.495
SMILES:
CCCCOc1nc(C)c(s1)-c1ccnc(Nc2ccc(OC)cc2OC)n1
: