Target
Neutrophil elastase
Ligand
BDBM7459
Substrate
Meas. Tech.
ChEMBL_1719626 (CHEMBL4134626)
Ki
10100±n/a nM
Citation
 Ryu, HWPark, YJLee, SULee, SYuk, HJSeo, KHKim, YUHwang, BYOh, SR Potential Anti-inflammatory Effects of the Fruits of Paulownia tomentosa. J Nat Prod 80:2659-2665 (2017)  
Target
Name:
Neutrophil elastase
Synonyms:
Bone marrow serine protease Coagulation factor X ELANE Elastase HLE Leukocyte elastase Medullasin Neutrophil elastase (HNE) PMN elastase Trypsin
Type:
Enzyme
Mol. Mass.:
28532.38
Organism:
Homo sapiens (Human)
Description:
P08246
Residue:
267
  
Inhibitor
Name:
BDBM7459
Synonyms:
2-(3,4-dihydroxyphenyl)-5,7-dihydroxy-4H-chromen-4-one CHEMBL151 Luteolin (4) cid_5280445 med.21724, Compound 3
Type:
Small organic molecule
Emp. Form.:
C15H10O6
Mol. Mass.:
286.2363
SMILES:
Oc1cc(O)c2c(c1)oc(cc2=O)-c1ccc(O)c(O)c1
: