Target
Lysine-specific histone demethylase 2
Ligand
BDBM50113851
Substrate
Meas. Tech.
ChEMBL_1720163 (CHEMBL4135163)
IC50
>100000±n/a nM
Citation
 Ji, YYLin, SDWang, YJSu, MBZhang, WGunosewoyo, HYang, FLi, JTang, JZhou, YBYu, LF Tying up tranylcypromine: Novel selective histone lysine specific demethylase 1 (LSD1) inhibitors. Eur J Med Chem 141:101-112 (2017)  
Target
Name:
Lysine-specific histone demethylase 2
Synonyms:
AOF1 Flavin-containing amine oxidase domain-containing protein 1 KDM1B_HUMAN Lysine-specific histone demethylase 1B | Lysine-specific histone demethylase 2
Type:
PROTEIN
Mol. Mass.:
92112.91
Organism:
Homo sapiens (Human)
Description:
ChEMBL_992590
Residue:
822
  
Inhibitor
Name:
BDBM50113851
Synonyms:
(+/-)-Tranylcypromine 2-Phenyl-cyclopropylamine CHEMBL313833 Tranylcypromine,(+) US8609708, 6 Tranyl- cypromine | US8609708, 6 Tranylcypromine
Type:
Small organic molecule
Emp. Form.:
C9H11N
Mol. Mass.:
133.1903
SMILES:
NC1CC1c1ccccc1
: