Target
Serine/threonine-protein kinase ULK1
Ligand
BDBM50280043
Substrate
Meas. Tech.
ChEMBL_1721618 (CHEMBL4136618)
IC50
183±n/a nM
Citation
 Wood, SDGrant, WAdrados, IChoi, JYAlburger, JMDuckett, DRRoush, WR  HTS and Structure Based Optimization of Indazole-Derived ULK1 Inhibitors. ACS Med Chem Lett 8:1258-1263 (2017)  
Target
Name:
Serine/threonine-protein kinase ULK1
Synonyms:
ATG1 KIAA0722 ULK1_HUMAN hATG1
Type:
PROTEIN
Mol. Mass.:
112661.80
Organism:
Homo sapiens (Human)
Description:
ChEMBL_1510275
Residue:
1050
  
Inhibitor
Name:
BDBM50280043
Synonyms:
CHEMBL4168817
Type:
Small organic molecule
Emp. Form.:
C22H25N5O3
Mol. Mass.:
407.4656
SMILES:
COC(=O)c1cccc(Nc2n[nH]c3ccc(NC(=O)C4CCCC(N)C4)cc23)c1
: