Target
Serine/threonine-protein kinase ULK1
Ligand
BDBM50280097
Substrate
Meas. Tech.
ChEMBL_1721618 (CHEMBL4136618)
IC50
110±n/a nM
Citation
 Wood, SDGrant, WAdrados, IChoi, JYAlburger, JMDuckett, DRRoush, WR  HTS and Structure Based Optimization of Indazole-Derived ULK1 Inhibitors. ACS Med Chem Lett 8:1258-1263 (2017)  
Target
Name:
Serine/threonine-protein kinase ULK1
Synonyms:
ATG1 KIAA0722 ULK1_HUMAN hATG1
Type:
PROTEIN
Mol. Mass.:
112661.80
Organism:
Homo sapiens (Human)
Description:
ChEMBL_1510275
Residue:
1050
  
Inhibitor
Name:
BDBM50280097
Synonyms:
CHEMBL4167729
Type:
Small organic molecule
Emp. Form.:
C21H25N5O2
Mol. Mass.:
379.4555
SMILES:
COc1ccccc1Nc1n[nH]c2ccc(NC(=O)C3CCCC(N)C3)cc12
: