Target
Serine/threonine-protein kinase ULK1
Ligand
BDBM50280098
Substrate
Meas. Tech.
ChEMBL_1721618 (CHEMBL4136618)
IC50
40±n/a nM
Citation
 Wood, SDGrant, WAdrados, IChoi, JYAlburger, JMDuckett, DRRoush, WR  HTS and Structure Based Optimization of Indazole-Derived ULK1 Inhibitors. ACS Med Chem Lett 8:1258-1263 (2017)  
Target
Name:
Serine/threonine-protein kinase ULK1
Synonyms:
ATG1 KIAA0722 ULK1_HUMAN hATG1
Type:
PROTEIN
Mol. Mass.:
112661.80
Organism:
Homo sapiens (Human)
Description:
ChEMBL_1510275
Residue:
1050
  
Inhibitor
Name:
BDBM50280098
Synonyms:
CHEMBL4176003
Type:
Small organic molecule
Emp. Form.:
C23H24N6O
Mol. Mass.:
400.4763
SMILES:
NC1CCCC(C1)C(=O)Nc1ccc2[nH]nc(Nc3cccc4ncccc34)c2c1
: