Target
Sigma non-opioid intracellular receptor 1
Ligand
BDBM50062551
Substrate
Meas. Tech.
ChEMBL_1722784 (CHEMBL4137784)
Ki
217±n/a nM
Citation
 Bautista-Aguilera, ÓMBudni, JMina, FMedeiros, EBDeuther-Conrad, WEntrena, JMMoraleda, IIriepa, ILópez-Muñoz, FMarco-Contelles, J Contilisant, a Tetratarget Small Molecule for Alzheimer's Disease Therapy Combining Cholinesterase, Monoamine Oxidase Inhibition, and H3R Antagonism with S1R Agonism Profile. J Med Chem 61:6937-6943 (2018)  
Target
Name:
Sigma non-opioid intracellular receptor 1
Synonyms:
Opioid receptor SGMR1_RAT Sigma non-opioid intracellular receptor 1 Sigma-1 | Sigmar1
Type:
Enzyme Catalytic Domain
Mol. Mass.:
25266.54
Organism:
RAT
Description:
Q9R0C9
Residue:
223
  
Inhibitor
Name:
BDBM50062551
Synonyms:
CHEBI:76010 GSK1349572 | S-349572
Type:
Small organic molecule
Emp. Form.:
C20H19F2N3O5
Mol. Mass.:
419.3788
SMILES:
[H][C@]12Cn3cc(C(=O)NCc4ccc(F)cc4F)c(=O)c(O)c3C(=O)N1[C@H](C)CCO2
: