Target
Vesicular acetylcholine transporter
Ligand
BDBM50018078
Substrate
Meas. Tech.
ChEMBL_1722786 (CHEMBL4137786)
Ki
49±n/a nM
Citation
 Bautista-Aguilera, ÓMBudni, JMina, FMedeiros, EBDeuther-Conrad, WEntrena, JMMoraleda, IIriepa, ILópez-Muñoz, FMarco-Contelles, J Contilisant, a Tetratarget Small Molecule for Alzheimer's Disease Therapy Combining Cholinesterase, Monoamine Oxidase Inhibition, and H3R Antagonism with S1R Agonism Profile. J Med Chem 61:6937-6943 (2018)  
Target
Name:
Vesicular acetylcholine transporter
Synonyms:
Slc18a3 VACHT_RAT Vat | rVAT
Type:
PROTEIN
Mol. Mass.:
56533.41
Organism:
Rattus norvegicus
Description:
ChEMBL_1503353
Residue:
530
  
Inhibitor
Name:
BDBM50018078
Synonyms:
2-(4-Phenyl-piperidin-1-yl)-cyclohexanol CHEMBL20943 V-100
Type:
Small organic molecule
Emp. Form.:
C17H25NO
Mol. Mass.:
259.3865
SMILES:
OC1CCCCC1N1CCC(CC1)c1ccccc1
: