Target
Aromatase
Ligand
BDBM50015987
Substrate
Meas. Tech.
ChEBML_50692
IC50
3200±n/a nM
Citation
 Laughton, CAMcKenna, RNeidle, SJarman, MMcCague, RRowlands, MG Crystallographic and molecular modeling studies on 3-ethyl-3-(4-pyridyl)piperidine-2,6-dione and its butyl analogue, inhibitors of mammalian aromatase. Comparison with natural substrates: prediction of enantioselectivity for N-alkyl derivatives. J Med Chem 33:2673-9 (1990)  
Target
Name:
Aromatase
Synonyms:
ARO1 CP19A_HUMAN CYP19 CYPXIX Cytochrome P450 19A1 Cytochrome P450-C19 (CYP19) FL cytokine receptor precursor | P-450AROM
Type:
Enzyme
Mol. Mass.:
57888.92
Organism:
Homo sapiens (Human)
Description:
P11511
Residue:
503
  
Inhibitor
Name:
BDBM50015987
Synonyms:
3-Heptyl-4,5-dihydro-3H-[3,4']bipyridinyl-2,6-dione | CHEMBL313485
Type:
Small organic molecule
Emp. Form.:
C17H24N2O2
Mol. Mass.:
288.3847
SMILES:
CCCCCCC[C@@]1(CCC(=O)NC1=O)c1ccncc1
: