Target
Vascular endothelial growth factor receptor 2
Ligand
BDBM50283263
Substrate
Meas. Tech.
ChEMBL_1725302 (CHEMBL4140580)
IC50
11±n/a nM
Citation
 Sun, YShan, YLi, CSi, RPan, XWang, BZhang, J Discovery of novel anti-angiogenesis agents. Part 8: Diaryl thiourea bearing 1H-indazole-3-amine as multi-target RTKs inhibitors. Eur J Med Chem 141:373-385 (2017)  
Target
Name:
Vascular endothelial growth factor receptor 2
Synonyms:
CD_antigen=CD309 Fetal liver kinase 1 (FLK-1) KDR Protein-tyrosine kinase receptor Flk-1 VEGFR-2 VEGFR2 Vascular Endothelial Growth Factor Receptor Kinase 2 Vascular endothelial growth factor receptor 2 (KDR) Vascular endothelial growth factor receptor 2 (VEGFR2) Vascular endothelial growth factor receptor-2 (VEGFR-2)
Type:
Receptor Tyrosine Kinase
Mol. Mass.:
151510.97
Organism:
Homo sapiens (Human)
Description:
P35968
Residue:
1356
  
Inhibitor
Name:
BDBM50283263
Synonyms:
CHEMBL4174374
Type:
Small organic molecule
Emp. Form.:
C21H17FN4O2
Mol. Mass.:
376.3837
SMILES:
Fc1ccccc1NC(=O)Nc1ccc(cc1)-c1cccc(NC(=O)C=C)n1
: