Target
Angiopoietin-1 receptor
Ligand
BDBM50283263
Substrate
Meas. Tech.
ChEMBL_1725303 (CHEMBL4140581)
IC50
17±n/a nM
Citation
 Sun, YShan, YLi, CSi, RPan, XWang, BZhang, J Discovery of novel anti-angiogenesis agents. Part 8: Diaryl thiourea bearing 1H-indazole-3-amine as multi-target RTKs inhibitors. Eur J Med Chem 141:373-385 (2017)  
Target
Name:
Angiopoietin-1 receptor
Synonyms:
TEK TIE2_HUMAN Tyrosine-protein kinase receptor (TIE-2) Tyrosine-protein kinase receptor TEK (p140 TEK) Tyrosine-protein kinase receptor TIE2/TEK VMCM1 p140 TEK
Type:
Enzyme
Mol. Mass.:
125835.70
Organism:
Homo sapiens (Human)
Description:
Q02763
Residue:
1124
  
Inhibitor
Name:
BDBM50283263
Synonyms:
CHEMBL4174374
Type:
Small organic molecule
Emp. Form.:
C21H17FN4O2
Mol. Mass.:
376.3837
SMILES:
Fc1ccccc1NC(=O)Nc1ccc(cc1)-c1cccc(NC(=O)C=C)n1
: