Target
Bromodomain-containing protein 2
Ligand
BDBM313807
Substrate
Meas. Tech.
ChEMBL_1728753 (CHEMBL4144031)
IC50
6.0±n/a nM
Citation
 Sharp, PPGarnier, JMHatfaludi, TXu, ZSegal, DJarman, KEJousset, HGarnham, AFeutrill, JTCuzzupe, AHall, PTaylor, SWalkley, CRTyler, DDawson, MACzabotar, PWilks, AFGlaser, SHuang, DCSBurns, CJ Design, Synthesis, and Biological Activity of 1,2,3-Triazolobenzodiazepine BET Bromodomain Inhibitors. ACS Med Chem Lett 8:1298-1303 (2017)  
Target
Name:
Bromodomain-containing protein 2
Synonyms:
BRD2 Bromodomain and extra-terminal motif (BET) Bromodomain-containing protein 2 (BRD2) RING3
Type:
Protein
Mol. Mass.:
88085.95
Organism:
Homo sapiens (Human)
Description:
P25440
Residue:
801
  
Inhibitor
Name:
BDBM313807
Synonyms:
US10167292, Example 51B
Type:
Small organic molecule
Emp. Form.:
C18H15ClN8
Mol. Mass.:
378.818
SMILES:
Cc1nnn2CCN(c3ccc(Cl)cc3)c3cc(ccc3-c12)-c1nn[nH]n1
: