Target
Bromodomain-containing protein 3
Ligand
BDBM313773
Substrate
Meas. Tech.
ChEMBL_1728755 (CHEMBL4144033)
IC50
10.0±n/a nM
Citation
 Sharp, PPGarnier, JMHatfaludi, TXu, ZSegal, DJarman, KEJousset, HGarnham, AFeutrill, JTCuzzupe, AHall, PTaylor, SWalkley, CRTyler, DDawson, MACzabotar, PWilks, AFGlaser, SHuang, DCSBurns, CJ Design, Synthesis, and Biological Activity of 1,2,3-Triazolobenzodiazepine BET Bromodomain Inhibitors. ACS Med Chem Lett 8:1298-1303 (2017)  
Target
Name:
Bromodomain-containing protein 3
Synonyms:
BRD3 Bromodomain and extra-terminal motif (BET) Bromodomain-containing protein 3 (BRD3) RING3-like protein | RING3L
Type:
Protein
Mol. Mass.:
79571.81
Organism:
Homo sapiens (Human)
Description:
Q15059
Residue:
726
  
Inhibitor
Name:
BDBM313773
Synonyms:
US10167292, Example 7
Type:
Small organic molecule
Emp. Form.:
C23H20ClN5
Mol. Mass.:
401.891
SMILES:
Cc1nnn2CCN(c3ccc(Cl)cc3)c3cc(ccc3-c12)-c1ccc(C)nc1
: