Target
Leucine--tRNA ligase
Ligand
BDBM50286771
Substrate
Meas. Tech.
ChEMBL_1729553 (CHEMBL4144831)
IC50
2700±n/a nM
Citation
 Charlton, MHAleksis, RSaint-Leger, AGupta, ALoza, ERibas de Pouplana, LKaula, IGustina, DMadre, MLola, DJaudzems, KEdmund, GRandall, CPKime, LO'Neill, AJGoessens, WJirgensons, AFinn, PW -Leucinyl Benzenesulfonamides as Structurally Simplified Leucyl-tRNA Synthetase Inhibitors. ACS Med Chem Lett 9:84-88 (2018)  
Target
Name:
Leucine--tRNA ligase
Synonyms:
6.1.1.4 Leucine--tRNA ligase SYL_STAA8 | leuS
Type:
PROTEIN
Mol. Mass.:
91758.59
Organism:
Staphylococcus aureus (strain NCTC 8325)
Description:
ChEMBL_117840
Residue:
805
  
Inhibitor
Name:
BDBM50286771
Synonyms:
CHEMBL4167692
Type:
Small organic molecule
Emp. Form.:
C17H22N4O3S
Mol. Mass.:
362.447
SMILES:
CC(C)C[C@H](N)C(=O)NS(=O)(=O)c1cccc(c1)-c1cc(C)ncn1
: