Target
Leucine--tRNA ligase, cytoplasmic
Ligand
BDBM50286767
Substrate
Meas. Tech.
ChEMBL_1729554 (CHEMBL4144832)
IC50
490±n/a nM
Citation
 Charlton, MHAleksis, RSaint-Leger, AGupta, ALoza, ERibas de Pouplana, LKaula, IGustina, DMadre, MLola, DJaudzems, KEdmund, GRandall, CPKime, LO'Neill, AJGoessens, WJirgensons, AFinn, PW -Leucinyl Benzenesulfonamides as Structurally Simplified Leucyl-tRNA Synthetase Inhibitors. ACS Med Chem Lett 9:84-88 (2018)  
Target
Name:
Leucine--tRNA ligase, cytoplasmic
Synonyms:
KIAA1352 LARS1 SYLC_HUMAN
Type:
PROTEIN
Mol. Mass.:
134475.20
Organism:
Homo sapiens (Human)
Description:
ChEMBL_98544
Residue:
1176
  
Inhibitor
Name:
BDBM50286767
Synonyms:
CHEMBL4172643
Type:
Small organic molecule
Emp. Form.:
C17H22N4O3S
Mol. Mass.:
362.447
SMILES:
CC(C)C[C@H](N)C(=O)NS(=O)(=O)c1cccc(c1)-c1ccnc(N)c1
: