Target
D(1A) dopamine receptor
Ligand
BDBM50016794
Substrate
Meas. Tech.
ChEMBL_58673 (CHEMBL670447)
Ki
1.7±n/a nM
Citation
 Chumpradit, SKung, HFBillings, JKung, MPPan, S (+/-)-7-chloro-8-hydroxy-1-(4'-[125I]iodophenyl)-3-methyl-2,3,4,5- tetrahydro-1H-3-benzazepine: a potential CNS D-1 dopamine receptor imaging agent. J Med Chem 32:1431-5 (1989)  
Target
Name:
D(1A) dopamine receptor
Synonyms:
DOPAMINE D1 Dopamine D1 high Dopamine receptor Dopamine1-like Drd1a
Type:
Enzyme Catalytic Domain
Mol. Mass.:
49429.75
Organism:
RAT
Description:
P18901
Residue:
446
  
Inhibitor
Name:
BDBM50016794
Synonyms:
8-Chloro-5-(4-iodo-phenyl)-3-methyl-2,3,4,5-tetrahydro-1H-benzo[d]azepin-7-ol | CHEMBL34170
Type:
Small organic molecule
Emp. Form.:
C17H17ClINO
Mol. Mass.:
413.68
SMILES:
CN1CCc2cc(Cl)c(O)cc2C(C1)c1ccc(I)cc1
: