Target
Cannabinoid receptor 1
Ligand
BDBM50288370
Substrate
Meas. Tech.
ChEMBL_1729892 (CHEMBL4145170)
EC50
0.030000±n/a nM
Citation
 Roy, JWatson, JEHong, ISFan, TMDas, A Antitumorigenic Properties of Omega-3 Endocannabinoid Epoxides. J Med Chem 61:5569-5579 (2018)  
Target
Name:
Cannabinoid receptor 1
Synonyms:
CANN6 CB-R CNR CNR1_HUMAN Cannabinoid receptor Cannabinoid receptor 1 (brain)
Type:
G Protein-Coupled Receptor (GPCR)
Mol. Mass.:
52868.96
Organism:
Homo sapiens (Human)
Description:
P21554
Residue:
472
  
Inhibitor
Name:
BDBM50288370
Synonyms:
CHEMBL4169198 | US11472787, Compound 10,11-EDP-CA
Type:
Small organic molecule
Emp. Form.:
C25H37NO2
Mol. Mass.:
383.5668
SMILES:
CC\C=C/C\C=C/C\C=C/CC1OC1C\C=C/C\C=C/CCC(=O)NC1CC1
: