Target
Tyrosine-protein kinase JAK3
Ligand
BDBM50288439
Substrate
Meas. Tech.
ChEMBL_1729907 (CHEMBL4145185)
IC50
12600±n/a nM
Citation
 Grimster, NPAnderson, EAlimzhanov, MBebernitz, GBell, KChuaqui, CDeegan, TFerguson, ADGero, THarsch, AHuszar, DKawatkar, AKettle, JGLyne, PRead, JARivard Costa, CRuston, LSchroeder, PShi, JSu, QThroner, SToader, DVasbinder, MWoessner, RWang, HWu, AYe, MZheng, WZinda, M Discovery and Optimization of a Novel Series of Highly Selective JAK1 Kinase Inhibitors. J Med Chem 61:5235-5244 (2018)  
Target
Name:
Tyrosine-protein kinase JAK3
Synonyms:
JAK-3 JAK3_HUMAN Janus kinase 3 (JAK3) L-JAK | Leukocyte janus kinase
Type:
Protein
Mol. Mass.:
125111.08
Organism:
Homo sapiens (Human)
Description:
P52333
Residue:
1124
  
Inhibitor
Name:
BDBM50288439
Synonyms:
CHEMBL4163817
Type:
Small organic molecule
Emp. Form.:
C23H27ClN6O3S
Mol. Mass.:
503.017
SMILES:
CN1CCN(CC1)c1cc(Nc2ncc(Cl)c(Nc3cccc(CO)c3)n2)cc(c1)S(C)(=O)=O
: