Target
Tyrosine-protein kinase JAK2
Ligand
BDBM50288440
Substrate
Meas. Tech.
ChEMBL_1729906 (CHEMBL4145184)
IC50
376±n/a nM
Citation
 Grimster, NPAnderson, EAlimzhanov, MBebernitz, GBell, KChuaqui, CDeegan, TFerguson, ADGero, THarsch, AHuszar, DKawatkar, AKettle, JGLyne, PRead, JARivard Costa, CRuston, LSchroeder, PShi, JSu, QThroner, SToader, DVasbinder, MWoessner, RWang, HWu, AYe, MZheng, WZinda, M Discovery and Optimization of a Novel Series of Highly Selective JAK1 Kinase Inhibitors. J Med Chem 61:5235-5244 (2018)  
Target
Name:
Tyrosine-protein kinase JAK2
Synonyms:
JAK-2 JAK2_HUMAN Janus kinase 2 (JAK2) | Janus kinase 2 (a protein tyrosine kinase)
Type:
Protein
Mol. Mass.:
130684.68
Organism:
Homo sapiens (Human)
Description:
O60674
Residue:
1132
  
Inhibitor
Name:
BDBM50288440
Synonyms:
CHEMBL4174879
Type:
Small organic molecule
Emp. Form.:
C25H28F2N6O
Mol. Mass.:
466.5262
SMILES:
[H][C@]12CN(c3cc(Nc4ncc(C)c(Nc5cccc(CO)c5)n4)cc(c3)C(F)F)[C@]([H])(CN1C)C2
: