Target
5-hydroxytryptamine receptor 7
Ligand
BDBM50318633
Substrate
Meas. Tech.
ChEMBL_1730839 (CHEMBL4146375)
Ki
14230±n/a nM
Citation
 Vanda, DSoural, MCanale, VChaumont-Dubel, SSata?a, GKos, TFunk, PFülöpová, VLemrová, BKoczurkiewicz, PP?kala, EBojarski, AJPopik, PMarin, PZajdel, P Novel non-sulfonamide 5-HT Eur J Med Chem 144:716-729 (2018)  
Target
Name:
5-hydroxytryptamine receptor 7
Synonyms:
5-HT-7 5-HT7 5-HT7S 5HT7 HTR7 | Serotonin receptor 7
Type:
G Protein-Coupled Receptor (GPCR)
Mol. Mass.:
53573.08
Organism:
Homo sapiens (Human)
Description:
P34969
Residue:
479
  
Inhibitor
Name:
BDBM50318633
Synonyms:
3-benzenesulfonyl-8-piperazin-1-ylquinoline SB-742457
Type:
Small organic molecule
Emp. Form.:
C19H19N3O2S
Mol. Mass.:
353.438
SMILES:
O=S(=O)(c1ccccc1)c1cnc2c(cccc2c1)N1CCNCC1
: