Target
Serine/threonine-protein kinase Chk2
Ligand
BDBM50291384
Substrate
Meas. Tech.
ChEMBL_1731081 (CHEMBL4146617)
IC50
28±n/a nM
Citation
 Galal, SAKhairat, SHMAli, HIShouman, SAAttia, YMAli, MMMahmoud, AEAbdel-Halim, AHFyiad, AATabll, AEl-Shenawy, REl Abd, YSRamdan, REl Diwani, HI Part II: New candidates of pyrazole-benzimidazole conjugates as checkpoint kinase 2 (Chk2) inhibitors. Eur J Med Chem 144:859-873 (2018)  
Target
Name:
Serine/threonine-protein kinase Chk2
Synonyms:
CDS1 CHK2 Checkpoint Kinase (Chk2) Serine/threonine-protein kinase Chek2 | Serine/threonine-protein kinase Chk1/2
Type:
Protein
Mol. Mass.:
60908.59
Organism:
Homo sapiens (Human)
Description:
O96017
Residue:
543
  
Inhibitor
Name:
BDBM50291384
Synonyms:
CHEMBL4177025
Type:
Small organic molecule
Emp. Form.:
C26H21N7O3S
Mol. Mass.:
511.555
SMILES:
Cc1nn(c(Sc2ccc(cc2)-c2nc3cc(ccc3[nH]2)C(O)=O)c1\C=N\NC(N)=O)-c1ccccc1
: