Target
Neuromedin-U receptor 2
Ligand
BDBM50291677
Substrate
Meas. Tech.
ChEMBL_1731400 (CHEMBL4146936)
IC50
1813±n/a nM
Citation
 De Prins, AMartin, CVan Wanseele, YSkov, LJTömböly, CTourwé, DCaveliers, VVan Eeckhaut, AHolst, BRosenkilde, MMSmolders, IBallet, S Development of potent and proteolytically stable human neuromedin U receptor agonists. Eur J Med Chem 144:887-897 (2018)  
Target
Name:
Neuromedin-U receptor 2
Synonyms:
G-protein coupled receptor FM-4 NMU-R2 NMU2R NMUR2_HUMAN TGR1
Type:
PROTEIN
Mol. Mass.:
47710.86
Organism:
Homo sapiens (Human)
Description:
ChEMBL_103075
Residue:
415
  
Inhibitor
Name:
BDBM50291677
Synonyms:
CHEMBL4168351
Type:
Small organic molecule
Emp. Form.:
C56H80N16O12
Mol. Mass.:
1169.3344
SMILES:
CC(C)C[C@H](NC(=O)[C@H](Cc1ccccc1)NC(=O)[C@H](Cc1ccc(O)cc1)NC(C)=O)C(=O)N(CC(=O)N[C@@H](CCCNC(N)=N)C(=O)N1CCC[C@H]1C(=O)N[C@@H](CCCNC(N)=N)C(=O)N[C@@H](CC(N)=O)C(N)=O)Cc1ccc(O)cc1
: