Target
Neuromedin-U receptor 2
Ligand
BDBM50291711
Substrate
Meas. Tech.
ChEMBL_1731400 (CHEMBL4146936)
IC50
14±n/a nM
Citation
 De Prins, AMartin, CVan Wanseele, YSkov, LJTömböly, CTourwé, DCaveliers, VVan Eeckhaut, AHolst, BRosenkilde, MMSmolders, IBallet, S Development of potent and proteolytically stable human neuromedin U receptor agonists. Eur J Med Chem 144:887-897 (2018)  
Target
Name:
Neuromedin-U receptor 2
Synonyms:
G-protein coupled receptor FM-4 NMU-R2 NMU2R NMUR2_HUMAN TGR1
Type:
PROTEIN
Mol. Mass.:
47710.86
Organism:
Homo sapiens (Human)
Description:
ChEMBL_103075
Residue:
415
  
Inhibitor
Name:
BDBM50291711
Synonyms:
CHEMBL4169739
Type:
Small organic molecule
Emp. Form.:
C60H86N16O11
Mol. Mass.:
1207.4254
SMILES:
[H][C@]12C[C@H](N(C(=O)[C@H](CCCNC(N)=N)NC(=O)[C@H](Cc3ccccc3)NC(=O)[C@H](CC(C)C)NC(=O)[C@H](Cc3ccccc3)NC(=O)[C@H](Cc3ccc(O)cc3)NC(C)=O)[C@@]1([H])CCCC2)C(=O)N[C@@H](CCCNC(N)=N)C(=O)N[C@@H](CC(N)=O)C(N)=O
: