Target
Neuromedin-U receptor 1
Ligand
BDBM50291709
Substrate
Meas. Tech.
ChEMBL_1731399 (CHEMBL4146935)
IC50
0.310000±n/a nM
Citation
 De Prins, AMartin, CVan Wanseele, YSkov, LJTömböly, CTourwé, DCaveliers, VVan Eeckhaut, AHolst, BRosenkilde, MMSmolders, IBallet, S Development of potent and proteolytically stable human neuromedin U receptor agonists. Eur J Med Chem 144:887-897 (2018)  
Target
Name:
Neuromedin-U receptor 1
Synonyms:
G-protein coupled receptor 66 GPR66 NMUR1 Neuromedin-U receptor 1
Type:
PROTEIN
Mol. Mass.:
47370.42
Organism:
Homo sapiens (Human)
Description:
ChEMBL_103121
Residue:
426
  
Inhibitor
Name:
BDBM50291709
Synonyms:
CHEMBL4160825
Type:
Small organic molecule
Emp. Form.:
C58H80N16O10
Mol. Mass.:
1161.357
SMILES:
CC(C)C[C@H](NC(=O)[C@H](Cc1ccccc1)NC(=O)[C@@H](N)Cc1ccc(O)cc1)C(=O)N[C@@H](Cc1cccc2ccccc12)C(=O)N[C@@H](CCCNC(N)=N)C(=O)N1CCC[C@H]1C(=O)N[C@@H](CCCNC(N)=N)C(=O)N[C@@H](CC(N)=O)C(N)=O
: