Target
Bromodomain-containing protein 4
Ligand
BDBM50311438
Substrate
Meas. Tech.
ChEBML_1733134
IC50
>20000±n/a nM
Citation
 Xiang, QWang, CZhang, YXue, XSong, MZhang, CLi, CWu, CLi, KHui, XZhou, YSmaill, JBPatterson, AVWu, DDing, KXu, Y Discovery and optimization of 1-(1H-indol-1-yl)ethanone derivatives as CBP/EP300 bromodomain inhibitors for the treatment of castration-resistant prostate cancer. Eur J Med Chem 147:238-252 (2018)  
Target
Name:
Bromodomain-containing protein 4
Synonyms:
BRD4 Bromodomain-containing protein 4 (BRD4) Protein HUNK1
Type:
Protein
Mol. Mass.:
152264.84
Organism:
Homo sapiens (Human)
Description:
O60885
Residue:
1362
  
Inhibitor
Name:
BDBM50311438
Synonyms:
CHEMBL4169942
Type:
Small organic molecule
Emp. Form.:
C24H24N2O6
Mol. Mass.:
436.4572
SMILES:
CC(=O)n1cc(C(=O)Nc2cc(COC3CCCCO3)cc(c2)C(O)=O)c2ccccc12
: